{"text_format":"2","workbook":"xlsx","n_sheets":8,"sheets":["Project Type Data","Country Data","Data Validation","How to use it","Area Model","Point Model","ROI Chart Area (Project)","ROI Chart Point (Project)"],"not_rendered":{"charts":2,"images":4,"macros":0,"external_links":0,"defined_names":4,"comments":0,"pivot_tables":0},"unopened":[],"bounds":{"document_bytes":16777216,"sheet_cells":100000,"run_cost":"one","rows_first":2000,"rows_last":500,"rows_between":2000,"halvings":0,"cell_chars":16384,"cell_head_chars":4096},"cells_cut":0,"cells_raw":0,"read":"whole","date_system":"1900"}

{"sheet":"Project Type Data","index":0,"n_rows":12,"n_cols":20,"rows_kept":12,"cut":false,"hidden":true,"merged":[]}
[null,null,"SitePrint Productivity (m²)",null,null,"SitePrint Productivity (ft²)",null,null,"Manual Productivity (m²)",null,null,"Manual Productivity (ft²)",null,null,"SitePrint Productivity (points)",null,null,"Manual Productivity (points)"]
["Project Type","Average $/sqft","High Density","Medium Density","Low Density","High Density","Medium Density","Low Density","High Density","Medium Density","Low Density","High Density","Medium Density","Low Density","High Density","Medium Density","Low Density","High Density","Medium Density","Low Density"]
["Hospitals and Other Health Treatment",531.57175498792367,{"$f":"+ROUNDUP(D3*0.75,-1)","v":230},300,{"$f":"+ROUNDUP(D3*1.25,-1)","v":380},{"$f":"+ROUNDUP(C3*10,-1)","v":2300},{"$f":"+ROUNDUP(D3*10,-1)","v":3000},{"$f":"+ROUNDUP(E3*10,-1)","v":3800},{"$f":"ROUNDUP(C3/8/5,0)*5","v":30},{"$f":"ROUNDUP(D3/8/5,0)*5","v":40},{"$f":"ROUNDUP(E3/8/5,0)*5","v":50},{"$f":"ROUNDUP(I3*10/5,0)*5","v":300},{"$f":"ROUNDUP(J3*10/5,0)*5","v":400},{"$f":"ROUNDUP(K3*10/5,0)*5","v":500},100,200,300,20,40,80]
["Hotels",278.56305669635714,{"$f":"+ROUNDUP(D4*0.75,-1)","v":230},300,{"$f":"+ROUNDUP(D4*1.25,-1)","v":380},{"$f":"+ROUNDUP(C4*10,-1)","v":2300},{"$f":"+ROUNDUP(D4*10,-1)","v":3000},{"$f":"+ROUNDUP(E4*10,-1)","v":3800},30,{"$f":"ROUNDUP(D4/8/5,0)*5","v":40},50,{"$f":"ROUNDUP(I4*10/5,0)*5","v":300},400,500,100,200,300,20,40,80]
["Manufacturing Plants",645.02739922259434,300,400,500,3000,4000,{"$f":"+ROUNDUP(E5*10,-1)","v":5000},40,50,65,400,500,650,100,200,300,20,40,80]
["Office and Bank Buildings",433.43917862971858,270,350,440,2700,3500,4400,35,45,55,350,450,550,100,200,300,20,40,80]
["Parking Garages",111.20508528532839,380,500,630,3800,5000,6300,50,65,80,500,650,800,100,200,300,20,40,80]
["Schools, Libraries, and Labs",553.51906065065771,230,300,380,2300,3000,3800,30,40,50,300,400,500,100,200,300,20,40,80]
["Warehouses",83.909112084904379,300,400,500,3000,4000,5000,40,50,65,400,500,650,100,200,300,20,40,80]
["Dormitories",392.37829089176438,230,300,380,2300,3000,3800,30,40,50,300,400,500,100,200,300,20,40,80]
["Residential Apartments",164.70261490890655,230,300,380,2300,3000,3800,30,40,50,300,400,500,100,200,300,20,40,80]
["Other",249.16274646687214,230,300,380,2300,3000,3800,30,40,50,300,400,500,100,200,300,20,40,80]

{"sheet":"Country Data","index":1,"n_rows":20,"n_cols":27,"rows_kept":20,"cut":false,"hidden":true,"merged":[]}
["Country","Currency","Metric","Price per Area","Price per Point","SitePrint Hardware Price","Average Hourly Rate","Conversion 1 USD to local currency","Robot Capping","Project Capping","Metric",{"$nulls":10},"Country","Currency","Metric","Price per Area","Average Hourly Rate","Maximum Productivity (Assuming two professionals)"]
["Australia","AUD","m²",2.5,2.5,87950,65,1.45,25000,25000,"m",null,null,null,{"$f":"+(G2*2)/Z2","v":2},null,null,null,"Australia",52,null,"Australia","AUD","m²",2.5,65,{"$f":"2*Z2/Y2","v":52}]
["Austria","EUR","m²",1.3,1.3,49500,55,0.9,13000,15000,"m",null,null,null,2,null,null,null,"Austria",84.615384615384613,null,"Austria","EUR","m²",1.3,55,{"$f":"2*Z3/Y3","v":84.615384615384613}]
["Belgium","EUR","m²",1.3,1.3,49500,35,0.9,13000,15000,"m",null,null,null,2,null,null,null,"Belgium",53.846153846153847,null,"Belgium","EUR","m²",1.3,35,53.846153846153847]
["Canada","CAD","m²",2.5,2.5,71500,110,1.35,16000,25000,"m",null,null,null,2,null,null,null,"Canada",88,null,"Canada","CAD","m²",2.5,110,88]
["Denmark","DKK","m²",13,13,350000,385,6.75,130000,130000,"m",null,null,null,2,null,null,null,"Denmark",59.230769230769234,null,"Denmark","DKK","m²",13,385,59.230769230769234]
["France","EUR","m²",1.3,1.3,49500,45,0.9,13000,15000,"m",null,null,null,2,null,null,null,"France",69.230769230769226,null,"France","EUR","m²",1.3,45,69.230769230769226]
["Germany","EUR","m²",1.3,1.3,49500,55,0.9,13000,15000,"m",null,null,null,2,null,null,null,"Germany",84.615384615384613,null,"Germany","EUR","m²",1.3,55,84.615384615384613]
["Ireland","EUR","m²",1.3,1.3,49500,45,0.9,13000,13000,"m",null,null,null,2,null,null,null,"Ireland",69.230769230769226,null,"Ireland","EUR","m²",1.3,45,69.230769230769226]
["Luxembourg","EUR","m²",1.3,1.3,49500,55,0.9,13000,15000,"m",null,null,null,2,null,null,null,"Luxembourg",84.615384615384613,null,"Luxembourg","EUR","m²",1.3,55,84.615384615384613]
["Netherland","EUR","m²",1.3,1.3,49500,45,0.9,13000,15000,"m",null,null,null,2,null,null,null,"Netherland",69.230769230769226,null,"Netherland","EUR","m²",1.3,45,69.230769230769226]
["New Zealand","NZD","m²",2.7,2.7,92950,75,1.59,27000,27000,"m",null,null,null,2,null,null,null,"New Zealand",55.55555555555555,null,"New Zealand","NZD","m²",2.7,75,55.55555555555555]
["Norway","NOK","m²",17,17,570000,485,10.55,170000,170000,"m",null,null,null,2,null,null,null,"Norway",57.058823529411768,null,"Norway","NOK","m²",17,485,57.058823529411768]
["Poland","EUR","m²",1.2,1.2,49500,45,0.9,12000,15000,"m",null,null,null,2,null,null,null,"Poland",75,null,"Poland","EUR","m²",1.2,45,75]
["Portugal","EUR","m²",1.2,1.2,49500,45,0.9,12000,15000,"m",null,null,null,2,null,null,null,"Portugal",75,null,"Portugal","EUR","m²",1.2,45,75]
["Switzerland","CHF","m²",1.5,1.5,49500,75,0.85,15000,15000,"m",null,null,null,2,null,null,null,"Schwitzerland",100,null,"Schwitzerland","CHF","m²",1.5,75,100]
["Spain","EUR","m²",1.2,1.2,49500,45,0.9,12000,15000,"m",null,null,null,2,null,null,null,"Spain",75,null,"Spain","EUR","m²",1.2,45,75]
["Sweden","SEK","m²",17,17,570000,430,10.26,170000,170000,"m",null,null,null,2,null,null,null,"Sweden",50.588235294117645,null,"Sweden","SEK","m²",17,430,50.588235294117645]
["United Kingdom","GBP","m²",1.1000000000000001,1.1000000000000001,44000,45,0.75,11000,11000,"m",null,null,null,2,null,null,null,"United Kingdom",81.818181818181813,null,"United Kingdom","GBP","m²",1.1000000000000001,45,81.818181818181813]
["United States","USD","ft²",0.2,2,54950,75,1,12000,20000,"ft",null,null,null,2,null,null,null,"United States",70.093457943925245,null,"United States","USD","ft²",0.2,75,750]

{"sheet":"Data Validation","index":2,"n_rows":27,"n_cols":7,"rows_kept":27,"cut":false,"hidden":true,"merged":[]}
["Point Only",null,null,null,{"$f":"+IF('Area Model'!E5=\"United States\",\"ft/h\",\"m/h\")","v":"ft/h"},null,"m/h"]
["Linework",null,null,null,{"$f":"+IF('Area Model'!E5=\"United States\",\"ft²/h\",\"m²/h\")","v":"ft²/h"},null,"m²/h"]
[{"$nulls":6},"ft/h"]
["General Contractor (Self-Perform)",{"$nulls":5},"ft²/h"]
["General Contractor (Non Self-Perform)"]
["Specialty Trade - Interior Contractor"]
["Specialty Trade - MEP/FP Contractor"]
["Specialty Trade - Concrete Contractor"]
["Geospatial Service Provider"]
["Industrial/Material Handling"]
["Other"]
[]
["High Density"]
["Medium Density"]
["Low Density"]
["Other"]
[]
["MRSP"]
["Other"]
[]
["None (0%)",0]
["Low (0.1 %)",1E-3]
["Medium (0.5%)",5.0000000000000001E-3]
["High (1%)",0.01]
[]
["MSRP"]
["Custom price"]

{"sheet":"How to use it","index":3,"n_rows":2,"n_cols":3,"rows_kept":2,"cut":false,"hidden":false,"merged":[]}
[]
[null,null,"Guide to Using the HP SitePrint ROI Tool"]

{"sheet":"Area Model","index":4,"n_rows":62,"n_cols":15,"rows_kept":62,"cut":false,"hidden":false,"merged":[]}
[]
[null,null,"HP SitePrint ROI Tool - Area Model"]
[null,null,"Project Details",{"$nulls":4},"Pricing and Initial Investment"]
[]
[null,null,"Country","Select country","United States",null,null,"HP SitePrint Robot Pricing",null,{"$f":"IF(J15=\"Custom Price\",M5,_xlfn.XLOOKUP(E5,'Country Data'!A:A,'Country Data'!F:F))","v":58800},{"$f":"_xlfn.XLOOKUP(E5,'Country Data'!A:A,'Country Data'!B:B)","v":"USD"},null,58800,{"$f":"+K5","v":"USD"}]
[]
[null,null,"Expected Layout Duration","(Input duration) →",10,"months",null,"HP SitePrint Usage Fee",null,{"$f":"IF(J15=\"Custom Price\",M7,_xlfn.XLOOKUP('Area Model'!E5,'Country Data'!A:A,'Country Data'!D:D))","v":0.2},{"$f":"+CONCATENATE(_xlfn.XLOOKUP(E5,'Country Data'!A:A,'Country Data'!B:B),\"/\",_xlfn.XLOOKUP(E5,'Country Data'!A:A,'Country Data'!C:C))","v":"USD/ft²"},null,0.2,{"$f":"+K7","v":"USD/ft²"}]
[]
[null,null,"Project Size","(Input size) →",400000,{"$f":"+_xlfn.XLOOKUP(E5,'Country Data'!A:A,'Country Data'!C:C)","v":"ft²"},null,"Robot Capping",null,{"$f":"IF(J15=\"Custom Price\",M9,_xlfn.XLOOKUP(E5,'Country Data'!A:A,'Country Data'!I:I))","v":12000},{"$f":"+CONCATENATE(_xlfn.XLOOKUP(E5,'Country Data'!A:A,'Country Data'!B:B),\"/\",\"Month\")","v":"USD/Month"},null,12000,{"$f":"+K9","v":"USD/Month"}]
[]
[null,null,"Nº of SitePrint Robots","(Input nº of robots) →",1,"robots",null,"Project capping",null,{"$f":"IF(J15=\"Custom Price\",M11,_xlfn.XLOOKUP(E5,'Country Data'!A:A,'Country Data'!J:J))","v":12000},{"$f":"+CONCATENATE(_xlfn.XLOOKUP(E5,'Country Data'!A:A,'Country Data'!B:B),\"/\",\"Month\")","v":"USD/Month"},null,12000,{"$f":"+K11","v":"USD/Month"}]
[]
[null,null,"Total Station Cost","(Input cost) →",0,{"$f":"+_xlfn.XLOOKUP(E5,'Country Data'!A:A,'Country Data'!B:B)","v":"USD"},null,"Initial investment",null,{"$f":"+J5*E11+E13*E11","v":58800},{"$f":"IF(N36=\"N/A\",\"\",_xlfn.XLOOKUP(E5,'Country Data'!A:A,'Country Data'!B:B))","v":"USD"}]
[]
[null,null,"Printed distance","(Input distance) →",null,{"$f":"+_xlfn.XLOOKUP(E5,'Country Data'!A:A,'Country Data'!K:K)","v":"ft"},null,null,null,"Custom price"]
[null,null,"Project Layout expenses"]
[]
[{"$nulls":4},"Traditional",{"$nulls":4},"SitePrint"]
[]
[null,null,"Crew Size","(Input crew size) →",2,"people",null,null,"(Input crew size) →",1,"people"]
[]
[null,null,"Hourly cost of layout professionals","(Input cost) →",75,{"$f":"+_xlfn.XLOOKUP(E5,'Country Data'!A:A,'Country Data'!B:B)","v":"USD"},null,null,"(Input cost) →",75,{"$f":"+_xlfn.XLOOKUP(E5,'Country Data'!A:A,'Country Data'!B:B)","v":"USD"}]
[]
[null,null,"Productivitity","(Input Productivity) →",330,"ft²/h",null,null,"(Input Productivity) →",3600,{"$f":"+F24","v":"ft²/h"},null,"Productivity Increase",{"$f":"IFERROR(CONCATENATE(ROUND((J24/E24),1),\"x\"),\"\")","v":"10.9x"},{"$f":"+IF(N24=\"\",\"\",IF((J24/E24)<=1,\"\",\"Faster\"))","v":"Faster"}]
[]
[null,null,"Layout Duration",null,{"$f":"+E27/8","v":151.5151515151515},"days",null,null,null,{"$f":"+J27/8","v":13.888888888888889},"days",null,"Layout time reduction",{"$f":"+E26-J26","v":137.62626262626262},"days"]
[{"$nulls":4},{"$f":"IF(OR(F24=\"m²/h\", F24=\"ft²/h\"), IFERROR(E9/E24,0), IF(OR(F24=\"m/h\", F24=\"ft/h\"), IFERROR(E15/E24,0), \"\"))","v":1212.121212121212},"hours",null,null,null,{"$f":"IF(OR(K24=\"m²/h\", K24=\"ft²/h\"), IFERROR(E9/J24,0), IF(OR(F24=\"m/h\", F24=\"ft/h\"), IFERROR(E15/J24,0), \"\"))","v":111.11111111111111},"hours",null,null,{"$f":"+E27-J27","v":1101.0101010101009},"hours"]
[{"$nulls":4},{"$f":"+E27*E20","v":2424.242424242424},"manhours",null,null,null,{"$f":"+J27*J20","v":111.11111111111111},"manhours",null,null,2313.1313131313127,"manhours"]
[]
[null,null,"Labor Costs",null,{"$f":"+E27*E20*E22","v":181818.18181818179},{"$f":"+_xlfn.XLOOKUP(E5,'Country Data'!A:A,'Country Data'!B:B)","v":"USD"},null,null,null,{"$f":"+J27*J20*J22","v":8333.3333333333339},{"$f":"+_xlfn.XLOOKUP(E5,'Country Data'!A:A,'Country Data'!B:B)","v":"USD"},null,"Labor Cost Reduction",{"$f":"+E30-J30","v":173484.84848484845},{"$f":"+_xlfn.XLOOKUP(E5,'Country Data'!A:A,'Country Data'!B:B)","v":"USD"}]
{"$rows_left_out":33}
{"sheet":"Point Model","index":5,"n_rows":61,"n_cols":15,"rows_kept":61,"cut":false,"hidden":false,"merged":[]}
[]
[null,null,"HP SitePrint ROI Tool - Point Model"]
[null,null,"Project Details",{"$nulls":4},"Pricing and Initial Investment"]
[]
[null,null,"Country","Select country","United States",null,null,"HP SitePrint Robot Pricing",null,{"$f":"IF(J15=\"Custom Price\",M5,_xlfn.XLOOKUP(E5,'Country Data'!A:A,'Country Data'!F:F))","v":54950},{"$f":"_xlfn.XLOOKUP(E5,'Country Data'!A:A,'Country Data'!B:B)","v":"USD"},null,null,{"$f":"+K5","v":"USD"}]
[]
[null,null,"Expected Layout Duration","(Input duration) →",null,"months",null,"HP SitePrint Usage Fee",null,{"$f":"IF(J15=\"Custom Price\",M7,_xlfn.XLOOKUP('Point Model'!E5,'Country Data'!A:A,'Country Data'!E:E))","v":2},{"$f":"+CONCATENATE(_xlfn.XLOOKUP(E5,'Country Data'!A:A,'Country Data'!B:B),\"/\",\"point\")","v":"USD/point"},null,null,{"$f":"+K7","v":"USD/point"}]
[]
[null,null,"Project Size","(Input size) →",null,"points",null,"Robot Capping",null,{"$f":"IF(J15=\"Custom Price\",M9,_xlfn.XLOOKUP(E5,'Country Data'!A:A,'Country Data'!I:I))","v":12000},{"$f":"+CONCATENATE(_xlfn.XLOOKUP(E5,'Country Data'!A:A,'Country Data'!B:B),\"/\",\"Month\")","v":"USD/Month"},null,null,{"$f":"+K9","v":"USD/Month"}]
[]
[null,null,"Nº of SitePrint Robots","(Input nº of robots) →",null,"robots",null,"Project capping",null,{"$f":"IF(J15=\"Custom Price\",M11,_xlfn.XLOOKUP(E5,'Country Data'!A:A,'Country Data'!J:J))","v":20000},{"$f":"+CONCATENATE(_xlfn.XLOOKUP(E5,'Country Data'!A:A,'Country Data'!B:B),\"/\",\"Month\")","v":"USD/Month"},null,null,{"$f":"+K11","v":"USD/Month"}]
[]
[null,null,"Total Station Cost","(Input cost) →",null,{"$f":"+_xlfn.XLOOKUP(E5,'Country Data'!A:A,'Country Data'!B:B)","v":"USD"},null,"Initial investment",null,{"$f":"+J5*E11+E13*E11","v":0},{"$f":"IF(N36=\"N/A\",\"\",_xlfn.XLOOKUP(E5,'Country Data'!A:A,'Country Data'!B:B))","v":"USD"}]
[]
[{"$nulls":9},"MSRP"]
[null,null,"Project Layout expenses"]
[]
[{"$nulls":4},"Traditional",{"$nulls":4},"SitePrint"]
[]
[null,null,"Crew Size","(Input crew size) →",null,"people",null,null,"(Input crew size) →",null,"people"]
[]
[null,null,"Hourly cost of layout professionals","(Input cost) →",null,{"$f":"+_xlfn.XLOOKUP(E5,'Country Data'!A:A,'Country Data'!B:B)","v":"USD"},null,null,"(Input cost) →",null,{"$f":"+_xlfn.XLOOKUP(E5,'Country Data'!A:A,'Country Data'!B:B)","v":"USD"}]
[]
[null,null,"Productivitity","(Input Productivity) →",null,"points/hour",null,null,"(Input Productivity) →",null,"points/hour",null,"Productivity Increase",{"$f":"IFERROR(CONCATENATE(ROUND((J24/E24),1),\"x\"),\"\")","v":""},{"$f":"+IF(N24=\"\",\"\",IF((J24/E24)<=1,\"\",\"Faster\"))","v":""}]
[]
[null,null,"Layout Duration",null,{"$f":"+E27/8","v":0},"days",null,null,null,{"$f":"+J27/8","v":0},"days",null,"Layout time reduction",{"$f":"+E26-J26","v":0},"days"]
[{"$nulls":4},{"$f":"IFERROR(E9/E24,0)","v":0},"hours",null,null,null,{"$f":"IFERROR(E9/J24,0)","v":0},"hours",null,null,{"$f":"+E27-J27","v":0},"hours"]
[{"$nulls":4},{"$f":"+E27*E20","v":0},"manhours",null,null,null,{"$f":"+J27*J20","v":0},"manhours",null,null,0,"manhours"]
[]
[null,null,"Labor Costs",null,{"$f":"+E27*E20*E22","v":0},{"$f":"+_xlfn.XLOOKUP(E5,'Country Data'!A:A,'Country Data'!B:B)","v":"USD"},null,null,null,{"$f":"+J27*J20*J22","v":0},{"$f":"+_xlfn.XLOOKUP(E5,'Country Data'!A:A,'Country Data'!B:B)","v":"USD"},null,"Labor Cost Reduction",{"$f":"+E30-J30","v":0},{"$f":"+_xlfn.XLOOKUP(E5,'Country Data'!A:A,'Country Data'!B:B)","v":"USD"}]
{"$rows_left_out":32}
{"sheet":"ROI Chart Area (Project)","index":6,"n_rows":5,"n_cols":61,"rows_kept":5,"cut":false,"hidden":true,"merged":[[0,37,0,48],[0,49,0,60],[0,1,0,12],[0,13,0,24],[0,25,0,36]]}
[null,"Year 1",{"$nulls":11},"Year 2",{"$nulls":11},"Year 3",{"$nulls":11},"Year 4",{"$nulls":11},"Year 5"]
[null,"Month 1","Month 2","Month 3","Month 4","Month 5","Month 6","Month 7","Month 8","Month 9","Month 10","Month 11","Month 12","Month 13","Month 14","Month 15","Month 16","Month 17","Month 18","Month 19","Month 20","Month 21","Month 22","Month 23","Month 24","Month 25","Month 26","Month 27","Month 28","Month 29","Month 30","Month 31","Month 32","Month 33","Month 34","Month 35","Month 36","Month 37","Month 38","Month 39","Month 40","Month 41","Month 42","Month 43","Month 44","Month 45","Month 46","Month 47","Month 48","Month 49","Month 50","Month 51","Month 52","Month 53","Month 54","Month 55","Month 56","Month 57","Month 58","Month 59","Month 60"]
["Initial Investment",{"$f":"+'Area Model'!J13","v":58800},{"$f":"+B3","v":58800},{"$f":"+C3","v":58800},58800,58800,58800,58800,58800,58800,58800,58800,58800,58800,58800,58800,58800,58800,58800,58800,58800,58800,58800,58800,58800,58800,58800,58800,58800,58800,58800,58800,58800,58800,58800,58800,58800,58800,58800,58800,58800,58800,58800,58800,58800,58800,58800,58800,58800,58800,58800,58800,58800,58800,58800,58800,58800,58800,58800,58800,58800]
["Monthly Savings",{"$f":"+'Area Model'!N37/'Area Model'!E7+'Area Model'!E49/'Area Model'!E7","v":9348.4848484848462},{"$f":"+B4","v":9348.4848484848462},{"$f":"+C4","v":9348.4848484848462},9348.4848484848462,9348.4848484848462,9348.4848484848462,9348.4848484848462,9348.4848484848462,9348.4848484848462,9348.4848484848462,9348.4848484848462,9348.4848484848462,9348.4848484848462,9348.4848484848462,9348.4848484848462,9348.4848484848462,9348.4848484848462,9348.4848484848462,9348.4848484848462,9348.4848484848462,9348.4848484848462,9348.4848484848462,9348.4848484848462,9348.4848484848462,9348.4848484848462,9348.4848484848462,9348.4848484848462,9348.4848484848462,9348.4848484848462,9348.4848484848462,9348.4848484848462,9348.4848484848462,9348.4848484848462,9348.4848484848462,9348.4848484848462,9348.4848484848462,9348.4848484848462,9348.4848484848462,9348.4848484848462,9348.4848484848462,9348.4848484848462,9348.4848484848462,9348.4848484848462,9348.4848484848462,9348.4848484848462,9348.4848484848462,9348.4848484848462,9348.4848484848462,9348.4848484848462,9348.4848484848462,9348.4848484848462,9348.4848484848462,9348.4848484848462,9348.4848484848462,9348.4848484848462,9348.4848484848462,9348.4848484848462,9348.4848484848462,9348.4848484848462,9348.4848484848462]
["Accumulated Savings",{"$f":"+B4","v":9348.4848484848462},{"$f":"+C4+B5","v":18696.969696969692},{"$f":"+D4+C5","v":28045.454545454537},37393.939393939385,46742.424242424233,56090.909090909081,65439.393939393929,74787.87878787877,84136.363636363618,93484.848484848466,102833.33333333331,112181.81818181816,121530.30303030301,130878.78787878786,140227.27272727271,149575.75757575754,158924.24242424237,168272.72727272721,177621.21212121204,186969.69696969687,196318.18181818171,205666.66666666654,215015.15151515137,224363.63636363621,233712.12121212104,243060.60606060587,252409.09090909071,261757.57575757554,271106.06060606037,280454.54545454524,289803.0303030301,299151.51515151496,308499.99999999983,317848.48484848469,327196.96969696955,336545.45454545441,345893.93939393928,355242.42424242414,364590.909090909,373939.39393939386,383287.87878787873,392636.36363636359,401984.84848484845,411333.33333333331,420681.81818181818,430030.30303030304,439378.7878787879,448727.27272727276,458075.75757575763,467424.24242424249,476772.72727272735,486121.21212121221,495469.69696969708,504818.18181818194,514166.6666666668,523515.15151515167,532863.63636363647,542212.12121212133,551560.60606060619,560909.09090909106]

{"sheet":"ROI Chart Point (Project)","index":7,"n_rows":5,"n_cols":61,"rows_kept":5,"cut":false,"hidden":true,"merged":[[0,1,0,12],[0,13,0,24],[0,25,0,36],[0,37,0,48],[0,49,0,60]]}
[null,"Year 1",{"$nulls":11},"Year 2",{"$nulls":11},"Year 3",{"$nulls":11},"Year 4",{"$nulls":11},"Year 5"]
[null,"Month 1","Month 2","Month 3","Month 4","Month 5","Month 6","Month 7","Month 8","Month 9","Month 10","Month 11","Month 12","Month 13","Month 14","Month 15","Month 16","Month 17","Month 18","Month 19","Month 20","Month 21","Month 22","Month 23","Month 24","Month 25","Month 26","Month 27","Month 28","Month 29","Month 30","Month 31","Month 32","Month 33","Month 34","Month 35","Month 36","Month 37","Month 38","Month 39","Month 40","Month 41","Month 42","Month 43","Month 44","Month 45","Month 46","Month 47","Month 48","Month 49","Month 50","Month 51","Month 52","Month 53","Month 54","Month 55","Month 56","Month 57","Month 58","Month 59","Month 60"]
["Initial Investment",{"$f":"+'Point Model'!J13","v":0},{"$f":"+B3","v":0},{"$f":"+C3","v":0},0,0,0,0,0,0,0,0,0,0,0,0,0,0,0,0,0,0,0,0,0,0,0,0,0,0,0,0,0,0,0,0,0,0,0,0,0,0,0,0,0,0,0,0,0,0,0,0,0,0,0,0,0,0,0,0,0]
["Monthly Savings",{"$f":"+'Point Model'!N37/'Point Model'!E7+'Point Model'!E48/'Point Model'!E7","v":{"$error":"#DIV/0!"}},{"$f":"+B4","v":{"$error":"#DIV/0!"}},{"$error":"#DIV/0!"},{"$error":"#DIV/0!"},{"$error":"#DIV/0!"},{"$error":"#DIV/0!"},{"$error":"#DIV/0!"},{"$error":"#DIV/0!"},{"$error":"#DIV/0!"},{"$error":"#DIV/0!"},{"$error":"#DIV/0!"},{"$error":"#DIV/0!"},{"$error":"#DIV/0!"},{"$error":"#DIV/0!"},{"$error":"#DIV/0!"},{"$error":"#DIV/0!"},{"$error":"#DIV/0!"},{"$error":"#DIV/0!"},{"$error":"#DIV/0!"},{"$error":"#DIV/0!"},{"$error":"#DIV/0!"},{"$error":"#DIV/0!"},{"$error":"#DIV/0!"},{"$error":"#DIV/0!"},{"$error":"#DIV/0!"},{"$error":"#DIV/0!"},{"$error":"#DIV/0!"},{"$error":"#DIV/0!"},{"$error":"#DIV/0!"},{"$error":"#DIV/0!"},{"$error":"#DIV/0!"},{"$error":"#DIV/0!"},{"$error":"#DIV/0!"},{"$error":"#DIV/0!"},{"$error":"#DIV/0!"},{"$error":"#DIV/0!"},{"$error":"#DIV/0!"},{"$error":"#DIV/0!"},{"$error":"#DIV/0!"},{"$error":"#DIV/0!"},{"$error":"#DIV/0!"},{"$error":"#DIV/0!"},{"$error":"#DIV/0!"},{"$error":"#DIV/0!"},{"$error":"#DIV/0!"},{"$error":"#DIV/0!"},{"$error":"#DIV/0!"},{"$error":"#DIV/0!"},{"$error":"#DIV/0!"},{"$error":"#DIV/0!"},{"$error":"#DIV/0!"},{"$error":"#DIV/0!"},{"$error":"#DIV/0!"},{"$error":"#DIV/0!"},{"$error":"#DIV/0!"},{"$error":"#DIV/0!"},{"$error":"#DIV/0!"},{"$error":"#DIV/0!"},{"$error":"#DIV/0!"},{"$error":"#DIV/0!"}]
["Accumulated Savings",{"$f":"+B4","v":{"$error":"#DIV/0!"}},{"$f":"+C4+B5","v":{"$error":"#DIV/0!"}},{"$f":"+D4+C5","v":{"$error":"#DIV/0!"}},{"$error":"#DIV/0!"},{"$error":"#DIV/0!"},{"$error":"#DIV/0!"},{"$error":"#DIV/0!"},{"$error":"#DIV/0!"},{"$error":"#DIV/0!"},{"$error":"#DIV/0!"},{"$error":"#DIV/0!"},{"$error":"#DIV/0!"},{"$error":"#DIV/0!"},{"$error":"#DIV/0!"},{"$error":"#DIV/0!"},{"$error":"#DIV/0!"},{"$error":"#DIV/0!"},{"$error":"#DIV/0!"},{"$error":"#DIV/0!"},{"$error":"#DIV/0!"},{"$error":"#DIV/0!"},{"$error":"#DIV/0!"},{"$error":"#DIV/0!"},{"$error":"#DIV/0!"},{"$error":"#DIV/0!"},{"$error":"#DIV/0!"},{"$error":"#DIV/0!"},{"$error":"#DIV/0!"},{"$error":"#DIV/0!"},{"$error":"#DIV/0!"},{"$error":"#DIV/0!"},{"$error":"#DIV/0!"},{"$error":"#DIV/0!"},{"$error":"#DIV/0!"},{"$error":"#DIV/0!"},{"$error":"#DIV/0!"},{"$error":"#DIV/0!"},{"$error":"#DIV/0!"},{"$error":"#DIV/0!"},{"$error":"#DIV/0!"},{"$error":"#DIV/0!"},{"$error":"#DIV/0!"},{"$error":"#DIV/0!"},{"$error":"#DIV/0!"},{"$error":"#DIV/0!"},{"$error":"#DIV/0!"},{"$error":"#DIV/0!"},{"$error":"#DIV/0!"},{"$error":"#DIV/0!"},{"$error":"#DIV/0!"},{"$error":"#DIV/0!"},{"$error":"#DIV/0!"},{"$error":"#DIV/0!"},{"$error":"#DIV/0!"},{"$error":"#DIV/0!"},{"$error":"#DIV/0!"},{"$error":"#DIV/0!"},{"$error":"#DIV/0!"},{"$error":"#DIV/0!"},{"$error":"#DIV/0!"}]